Target
SRSF protein kinase 1
Ligand
BDBM351702
Substrate
Meas. Tech.
In Vitro Kinase Assay
IC50
10000±n/a nM
Citation
 Bates, DMorris, J Piperazine derivatives for treating disorders US Patent  US9796707 Publication Date 10/24/2017 
Target
Name:
SRSF protein kinase 1
Synonyms:
SRPK1 SRSF protein kinase 1 (SRPK1) Serine/threonine-protein kinase SRPK1
Type:
Protein
Mol. Mass.:
74318.38
Organism:
Homo sapiens (Human)
Description:
Q96SB4
Residue:
655
  
Inhibitor
Name:
BDBM351702
Synonyms:
US9796707, Compound 35
Type:
Small organic molecule
Emp. Form.:
C25H22F3N7O2
Mol. Mass.:
509.4831
SMILES:
FC(F)(F)c1ccc(N2CCN(Cc3ccccn3)CC2)c(NC(=O)c2noc(n2)-c2ccncc2)c1
: