Target
SRSF protein kinase 1
Ligand
BDBM101822
Substrate
Meas. Tech.
In Vitro Kinase Assay
IC50
323±n/a nM
Citation
 Bates, DMorris, J Piperazine derivatives for treating disorders US Patent  US9796707 Publication Date 10/24/2017 
Target
Name:
SRSF protein kinase 1
Synonyms:
SRPK1 SRSF protein kinase 1 (SRPK1) Serine/threonine-protein kinase SRPK1
Type:
Protein
Mol. Mass.:
74318.38
Organism:
Homo sapiens (Human)
Description:
Q96SB4
Residue:
655
  
Inhibitor
Name:
BDBM101822
Synonyms:
US9695160, 37 | US9796707, Compound 37
Type:
Small organic molecule
Emp. Form.:
C28H26F3N5O3
Mol. Mass.:
537.5329
SMILES:
COc1ccc(cn1)-c1ccc(o1)C(=O)Nc1cc(ccc1N1CCN(Cc2ccccn2)CC1)C(F)(F)F
: