Target
SRSF protein kinase 1
Ligand
BDBM101826
Substrate
Meas. Tech.
In Vitro Kinase Assay
IC50
4688±n/a nM
Citation
 Bates, DMorris, J Piperazine derivatives for treating disorders US Patent  US9796707 Publication Date 10/24/2017 
Target
Name:
SRSF protein kinase 1
Synonyms:
SRPK1 SRSF protein kinase 1 (SRPK1) Serine/threonine-protein kinase SRPK1
Type:
Protein
Mol. Mass.:
74318.38
Organism:
Homo sapiens (Human)
Description:
Q96SB4
Residue:
655
  
Inhibitor
Name:
BDBM101826
Synonyms:
US9695160, 40 | US9796707, Compound 40
Type:
Small organic molecule
Emp. Form.:
C17H18F3N3OS
Mol. Mass.:
369.405
SMILES:
CN1CCN(CC1)c1ccc(cc1NC(=O)c1cccs1)C(F)(F)F
: