Target
Prothrombin
Ligand
BDBM176000
Substrate
Meas. Tech.
Platelet Aggregation (PRP) Assay
Temperature
298.15±n/a K
IC50
38.0±n/a nM
Comments
extracted
Citation
 Banville, JRemillard, RRuediger, EHDeon, DHGagnon, MDube, LGuy, JPriestley, ESPosy, SLMaxwell, BDWong, PCLawrence, RMMiller, MM Imidazothiadiazole and imidazopyrazine derivatives as protease activated receptor 4 (PAR4) inhibitors for treating platelet aggregation US Patent  US10047103 Publication Date 8/14/2018 
Target
Name:
Prothrombin
Synonyms:
Activation peptide fragment 1 Coagulation factor II Prothrombin precursor Thrombin heavy chain | Thrombin light chain
Type:
Protein
Mol. Mass.:
70029.57
Organism:
Homo sapiens (Human)
Description:
P00734
Residue:
622
  
Inhibitor
Name:
BDBM176000
Synonyms:
US10047103, 33 US9688695, 33
Type:
Small organic molecule
Emp. Form.:
C22H17N5O5S2
Mol. Mass.:
495.531
SMILES:
COc1nn2cc(nc2s1)-c1cc2c(OCc3csc(n3)-c3cc(C)on3)cc(OC)cc2o1
: