Target
Coagulation factor X
Ligand
BDBM17253
Substrate
BDBM12658
Meas. Tech.
Enzyme Inhibition Assay
Ki
1.4±n/a nM
Citation
 Kochanny, MJAdler, MEwing, JGriedel, BDHo, EKaranjawala, RLee, WLentz, DLiang, AMMorrissey, MMPhillips, GBPost, JSacchi, KLSakata, STSubramanyam, BVergona, RWalters, JWhite, KAWhitlow, MYe, BZhao, ZShaw, KJ Substituted thiophene-anthranilamides as potent inhibitors of human factor Xa. Bioorg Med Chem 15:2127-46 (2007)  
Target
Name:
Coagulation factor X
Synonyms:
Activated coagulation factor X (FXa) Coagulation factor X precursor F10 Factor X heavy chain Factor Xa Stuart-Prower factor
Type:
Enzyme
Mol. Mass.:
54726.60
Organism:
Homo sapiens (Human)
Description:
Residue:
488
  
Inhibitor
Name:
BDBM17253
Synonyms:
3-chloro-N-{4-chloro-2-[(4-chlorophenyl)carbamoyl]phenyl}-4-{[(2,3-dihydroxypropyl)(methyl)amino]methyl}thiophene-2-carboxamide | thiophene-containing non-amidine inhibitor, 55
Type:
Small organic molecule
Emp. Form.:
C23H22Cl3N3O4S
Mol. Mass.:
542.862
SMILES:
CN(CC(O)CO)Cc1csc(C(=O)Nc2ccc(Cl)cc2C(=O)Nc2ccc(Cl)cc2)c1Cl
:
Substrate
Name:
BDBM12658
Synonyms:
4-[({[(1S)-4-carbamimidamido-1-[(4-nitrophenyl)carbamoyl]butyl]carbamoyl}methyl)carbamoyl]-4-[(2S,3S)-3-methyl-2-(phenylformamido)pentanamido]butanoic acid hydrochloride Chromogenic Substrate S-2222 benzoyl-Ile-Glu-Gly-Arg-p-nitroanilide
Type:
Small organic molecule
Emp. Form.:
C32H43N9O9
Mol. Mass.:
697.7387
SMILES:
[#6]-[#6]-[#6@H](-[#6])-[#6@H](-[#7]-[#6](=O)-c1ccccc1)-[#6](=O)-[#7]-[#6@@H](-[#6]-[#6]-[#6](-[#8])=O)-[#6](=O)-[#7]-[#6]-[#6](=O)-[#7]-[#6@@H](-[#6]-[#6]-[#6]\[#7]=[#6](\[#7])-[#7])-[#6](=O)-[#7]-c1ccc(cc1)-[#7+](-[#8-])=O
: