Target
E3 ubiquitin-protein ligase XIAP [241-356]
Ligand
BDBM17343
Substrate
BDBM17342
Meas. Tech.
Fluorescence Polarization Affinity Measurements.
pH
7.2±n/a
Temperature
295.15±n/a K
Ki
39800±n/a nM
Citation
 Zobel, KWang, LVarfolomeev, EFranklin, MCElliott, LOWallweber, HJOkawa, DCFlygare, JAVucic, DFairbrother, WJDeshayes, K Design, synthesis, and biological activity of a potent Smac mimetic that sensitizes cancer cells to apoptosis by antagonizing IAPs. ACS Chem Biol 1:525-33 (2006)  
Target
Name:
E3 ubiquitin-protein ligase XIAP [241-356]
Synonyms:
API3 BIRC4 E3 ubiquitin-protein ligase XIAP BIR-3 IAP3 X-linked inhibitor of apoptosis protein BIR3 domain (XIAP BIR-3) XIAP-BIR3 baculovirus IAP repeat 3 (BIR3) domain of XIAP
Type:
Protein Binding Domain
Mol. Mass.:
13276.62
Organism:
Homo sapiens (Human)
Description:
BIR3 of XIAP: RESIDUES 241-356.
Residue:
116
  
Inhibitor
Name:
BDBM17343
Synonyms:
(2S)-2-[(2S)-2-[(2S)-6-amino-2-[(2S)-2-[(2S)-2-[(2S,3S)-2-{1-[(3S)-3-[(2S)-2-aminopropanamido]-2-oxoazepan-1-yl]acetamido}-3-methylpentanamido]propanamido]pentanediamido]hexanamido]-3-hydroxypropanamido]pentanedioic acid | Smac-derived compound, 2
Type:
Small organic molecule
Emp. Form.:
C39H67N11O14
Mol. Mass.:
914.0146
SMILES:
CCC(C)[C@H](NC(=O)CN1CCCC[C@H](NC(=O)[C@H](C)N)C1=O)C(=O)N[C@@H](C)C(=O)N[C@@H](CCC(N)=O)C(=O)N[C@@H](CCCCN)C(=O)N[C@@H](CO)C(=O)N[C@@H](CCC(O)=O)C(O)=O
:
Substrate
Name:
BDBM17342
Synonyms:
5-carboxyflourescein(5-FAM)-conjugated AVPFFAKK | AVP-diPhe-FAM
Type:
Fluorescent dye-conjugated peptide
Emp. Form.:
Mol. Mass.:
SMILES:
: