Target
E3 ubiquitin-protein ligase XIAP [241-356]
Ligand
BDBM17347
Substrate
BDBM17342
Meas. Tech.
Fluorescence Polarization Affinity Measurements.
pH
7.2±n/a
Temperature
295.15±n/a K
Ki
270±n/a nM
Citation
 Zobel, KWang, LVarfolomeev, EFranklin, MCElliott, LOWallweber, HJOkawa, DCFlygare, JAVucic, DFairbrother, WJDeshayes, K Design, synthesis, and biological activity of a potent Smac mimetic that sensitizes cancer cells to apoptosis by antagonizing IAPs. ACS Chem Biol 1:525-33 (2006)  
Target
Name:
E3 ubiquitin-protein ligase XIAP [241-356]
Synonyms:
API3 BIRC4 E3 ubiquitin-protein ligase XIAP BIR-3 IAP3 X-linked inhibitor of apoptosis protein BIR3 domain (XIAP BIR-3) XIAP-BIR3 baculovirus IAP repeat 3 (BIR3) domain of XIAP
Type:
Protein Binding Domain
Mol. Mass.:
13276.62
Organism:
Homo sapiens (Human)
Description:
BIR3 of XIAP: RESIDUES 241-356.
Residue:
116
  
Inhibitor
Name:
BDBM17347
Synonyms:
(3R,6S,9aR)-N-(3-methyl-1-phenyl-1H-pyrazol-5-yl)-6-[(2S)-2-(methylamino)propanamido]-5-oxo-octahydroazepino[2,1-b][1,3]thiazole-3-carboxamide | peptide isostere, 10
Type:
Small organic molecule
Emp. Form.:
C23H30N6O3S
Mol. Mass.:
470.588
SMILES:
[H][C@@]12CCC[C@H](NC(=O)[C@H](C)NC)C(=O)N1[C@@H](CS2)C(=O)Nc1cc(C)nn1-c1ccccc1
:
Substrate
Name:
BDBM17342
Synonyms:
5-carboxyflourescein(5-FAM)-conjugated AVPFFAKK | AVP-diPhe-FAM
Type:
Fluorescent dye-conjugated peptide
Emp. Form.:
Mol. Mass.:
SMILES:
: