Target
Fibroblast growth factor receptor 3
Ligand
BDBM356566
Substrate
Meas. Tech.
FGFR3 Enzymatic Assay
IC50
<10±n/a nM
Citation
 Yao, WZhang, CXu, MZhuo, JHe, C Substituted imidazopyridazines and benzimidazoles as inhibitors of FGFR3 US Patent  US10213427 Publication Date 2/26/2019 
Target
Name:
Fibroblast growth factor receptor 3
Synonyms:
CD_antigen: CD333 FGFR3 Fibroblast growth factor receptor JTK4
Type:
Protein
Mol. Mass.:
87699.57
Organism:
Homo sapiens (Human)
Description:
P22607
Residue:
806
  
Inhibitor
Name:
BDBM356566
Synonyms:
N-Methyl-2-(4-{3-[3-({[(2,2,2-trifluoroethyl)amino]carbonyl}amino)phenyl]imidazo[1,2-b]pyridazin-7-yl}-1H-pyrazol-1-yl)propanamide US10813930, Ex. No. 55
Type:
Small organic molecule
Emp. Form.:
C22H23F3N8O2
Mol. Mass.:
488.4656
SMILES:
CNC(=O)C(C)N\C=C(/C=N)c1cnn2c(cnc2c1)-c1cccc(NC(=O)NCC(F)(F)F)c1
: