Target
Fibroblast growth factor receptor 3
Ligand
BDBM356589
Substrate
Meas. Tech.
FGFR3 Enzymatic Assay
IC50
<10±n/a nM
Citation
 Yao, WZhang, CXu, MZhuo, JHe, C Substituted imidazopyridazines and benzimidazoles as inhibitors of FGFR3 US Patent  US10213427 Publication Date 2/26/2019 
Target
Name:
Fibroblast growth factor receptor 3
Synonyms:
CD_antigen: CD333 FGFR3 Fibroblast growth factor receptor JTK4
Type:
Protein
Mol. Mass.:
87699.57
Organism:
Homo sapiens (Human)
Description:
P22607
Residue:
806
  
Inhibitor
Name:
BDBM356589
Synonyms:
N-[3-(7-{1-[3-(Cyanomethyl)-1-(cyclopropylacetyl)azetidin-3-yl]-1H-pyrazol-4-yl}imidazo[1,2-b]pyridazin-3-yl)phenyl]-N′-(2,2,2-trifluoroethyl)urea | US10213427, Example 78
Type:
Small organic molecule
Emp. Form.:
C28H28F3N9O2
Mol. Mass.:
579.5762
SMILES:
FC(F)(F)CNC(=O)Nc1cccc(c1)-c1cnc2cc(cnn12)C(\C=N)=C\NC1(CC#N)CN(C1)C(=O)CC1CC1
: