Target
Fibroblast growth factor receptor 3
Ligand
BDBM356599
Substrate
Meas. Tech.
FGFR3 Enzymatic Assay
IC50
<10±n/a nM
Citation
 Yao, WZhang, CXu, MZhuo, JHe, C Substituted imidazopyridazines and benzimidazoles as inhibitors of FGFR3 US Patent  US10213427 Publication Date 2/26/2019 
Target
Name:
Fibroblast growth factor receptor 3
Synonyms:
CD_antigen: CD333 FGFR3 Fibroblast growth factor receptor JTK4
Type:
Protein
Mol. Mass.:
87699.57
Organism:
Homo sapiens (Human)
Description:
P22607
Residue:
806
  
Inhibitor
Name:
BDBM356599
Synonyms:
Cyclopropylmethyl 3-(cyanomethyl)-3-(4-{3-[3-({[(2,2,2-trifluoroethyl)amino]carbonyl}amino)phenyl]imidazo[1,2-b]pyridazin-7-yl}-1H-pyrazol-1-yl)azetidine-1-carboxylate | US10213427, Example 88
Type:
Small organic molecule
Emp. Form.:
C28H28F3N9O3
Mol. Mass.:
595.5756
SMILES:
FC(F)(F)CNC(=O)Nc1cccc(c1)-c1cnc2cc(cnn12)C(\C=N)=C\NC1(CC#N)CN(C1)C(=O)OCC1CC1
: