Target
Fibroblast growth factor receptor 3
Ligand
BDBM356615
Substrate
Meas. Tech.
FGFR3 Enzymatic Assay
IC50
<10±n/a nM
Citation
 Yao, WZhang, CXu, MZhuo, JHe, C Substituted imidazopyridazines and benzimidazoles as inhibitors of FGFR3 US Patent  US10213427 Publication Date 2/26/2019 
Target
Name:
Fibroblast growth factor receptor 3
Synonyms:
CD_antigen: CD333 FGFR3 Fibroblast growth factor receptor JTK4
Type:
Protein
Mol. Mass.:
87699.57
Organism:
Homo sapiens (Human)
Description:
P22607
Residue:
806
  
Inhibitor
Name:
BDBM356615
Synonyms:
N-[3-(7-{4-[2-(3-Hydroxyazetidin-1-yl)-1-methyl-2-oxoethyl]phenyl}imidazo[1,2-b]pyridazin-3-yl)phenyl]-N′-(2,2,2-trifluoroethyl)urea US10813930, Ex. No. 104
Type:
Small organic molecule
Emp. Form.:
C27H25F3N6O3
Mol. Mass.:
538.521
SMILES:
CC(C(=O)N1CC(O)C1)c1ccc(cc1)-c1cnn2c(cnc2c1)-c1cccc(NC(=O)NCC(F)(F)F)c1
: