Target
Isoleucine--tRNA ligase
Ligand
BDBM18144
Substrate
BDBM18140
Meas. Tech.
Competitive Ligand Binding Assay
pH
7.5±n/a
Temperature
293.15±n/a K
Ki
530000±140000 nM
Citation
 Flossdorf, JPratorius, HJKula, MR Influence of side-chain structure of aliphatic amino acids on binding to isoleucyl-tRNA synthetase from Escherichia coli MRE 600. Eur J Biochem 66:147-55 (1976)  
Target
Name:
Isoleucine--tRNA ligase
Synonyms:
Isoleucine--tRNA ligase ileS tRNA synthetase (IleRS)
Type:
Enzyme
Mol. Mass.:
104286.05
Organism:
Escherichia coli
Description:
Residue:
938
  
Inhibitor
Name:
BDBM18144
Synonyms:
2-amino-3-ethylpentanoic acid | DL-2-Amino-3-ethyl pentanoic acid
Type:
Small organic molecule
Emp. Form.:
C7H15NO2
Mol. Mass.:
145.1995
SMILES:
CCC(CC)C(N)C(O)=O
:
Substrate
Name:
BDBM18140
Synonyms:
(2S,3S)-2-amino-3-methylpentanoic acid L-[14C]Isoleucine
Type:
Amino Acid
Emp. Form.:
C6H13NO2
Mol. Mass.:
131.1729
SMILES:
CC[C@H](C)[C@H](N)C(O)=O
: