Target
Androgen receptor
Ligand
BDBM18179
Substrate
BDBM18161
Meas. Tech.
Receptor Binding and Transactivation Assay
pH
7.4±n/a
Temperature
295.15±n/a K
Ki
4.0±n/a nM
EC50
87±n/a nM
Comments
Compound is full agonist with IA>85% relative to DHT control (IA=100%)
Citation
 Li, JJSutton, JCNirschl, AZou, YWang, HSun, CPi, ZJohnson, RKrystek, SRSeethala, RGolla, RSleph, PGBeehler, BCGrover, GJFura, AVyas, VPLi, CYGougoutas, JZGalella, MAZahler, ROstrowski, JHamann, LG Discovery of Potent and Muscle Selective Androgen Receptor Modulators through Scaffold Modifications. J Med Chem 50:3015-3025 (2007)  
Target
Name:
Androgen receptor
Synonyms:
ANDR_HUMAN Androgen Receptor Androgen receptor/Baculoviral IAP repeat-containing protein 2 Dihydrotestosterone receptor Nuclear receptor subfamily 3 group C member 4
Type:
Receptor
Mol. Mass.:
99185.27
Organism:
Homo sapiens (Human)
Description:
CHO cells were stably transfected with human AR gene.
Residue:
920
  
Inhibitor
Name:
BDBM18179
Synonyms:
4-[(1R,7S,7aR)-7-hydroxy-1-methyl-3-oxo-hexahydro-1H-pyrrolo[1,2-a]imidazolidin-2-yl]-2-chloro-3-methylbenzonitrile | imidazolin-2-one, 10b
Type:
Small organic molecule
Emp. Form.:
C15H16ClN3O2
Mol. Mass.:
305.759
SMILES:
[H][C@@]12[C@@H](O)CCN1C(=O)N([C@@H]2C)c1ccc(C#N)c(Cl)c1C
:
Substrate
Name:
BDBM18161
Synonyms:
(1S,2S,7S,10R,11S,14S,15S)-14-hydroxy-2,15-dimethyltetracyclo[8.7.0.0^{2,7}.0^{11,15}]heptadecan-5-one CHEMBL27769 Dihydrotestosterone | [3H]DHT
Type:
Steroid
Emp. Form.:
C19H30O2
Mol. Mass.:
290.4403
SMILES:
[H][C@@]12CC[C@H](O)[C@@]1(C)CC[C@@]1([H])[C@@]2([H])CC[C@@]2([H])CC(=O)CC[C@]12C
: