Target
Myeloperoxidase
Ligand
BDBM357642
Substrate
Meas. Tech.
MPO Peroxidation Assay (Amplex Red Assay)
IC50
500±n/a nM
Citation
 Shaw, SASmallheer, JM Triazolopyridine inhibitors of myeloperoxidase US Patent  US10214527 Publication Date 2/26/2019 
Target
Name:
Myeloperoxidase
Synonyms:
84 kDa myeloperoxidase MPO Myeloperoxidase Myeloperoxidase heavy chain PERM_HUMAN
Type:
Enzyme
Mol. Mass.:
83888.32
Organism:
Homo sapiens (Human)
Description:
P05164
Residue:
745
  
Inhibitor
Name:
BDBM357642
Synonyms:
7-((3'-fluoro- [1,1'- biphenyl]-3- yl) methyl)- 3H- [1,2,3]triazolo [4,5-b] pyridin- 5-amine | US10214527, Example 14
Type:
Small organic molecule
Emp. Form.:
C18H14FN5
Mol. Mass.:
319.3357
SMILES:
Nc1cc(Cc2cccc(c2)-c2cccc(F)c2)c2nn[nH]c2n1
: