Target
Myeloperoxidase
Ligand
BDBM357649
Substrate
Meas. Tech.
MPO Chlorination Assay (APF Assay)
IC50
55±n/a nM
Citation
 Shaw, SASmallheer, JM Triazolopyridine inhibitors of myeloperoxidase US Patent  US10214527 Publication Date 2/26/2019 
Target
Name:
Myeloperoxidase
Synonyms:
84 kDa myeloperoxidase MPO Myeloperoxidase Myeloperoxidase heavy chain PERM_HUMAN
Type:
Enzyme
Mol. Mass.:
83888.32
Organism:
Homo sapiens (Human)
Description:
P05164
Residue:
745
  
Inhibitor
Name:
BDBM357649
Synonyms:
7-(5-chloro-2- fluorobenzyl)- 3H-[1,2,3] triazolo[4,5- b]pyridin-5- amine | US10214527, Example 21
Type:
Small organic molecule
Emp. Form.:
C12H9ClFN5
Mol. Mass.:
277.685
SMILES:
Nc1cc(Cc2cc(Cl)ccc2F)c2nn[nH]c2n1
: