Target
Myeloperoxidase
Ligand
BDBM357672
Substrate
Meas. Tech.
MPO Peroxidation Assay (Amplex Red Assay)
IC50
55±n/a nM
Citation
 Shaw, SASmallheer, JM Triazolopyridine inhibitors of myeloperoxidase US Patent  US10214527 Publication Date 2/26/2019 
Target
Name:
Myeloperoxidase
Synonyms:
84 kDa myeloperoxidase MPO Myeloperoxidase Myeloperoxidase heavy chain PERM_HUMAN
Type:
Enzyme
Mol. Mass.:
83888.32
Organism:
Homo sapiens (Human)
Description:
P05164
Residue:
745
  
Inhibitor
Name:
BDBM357672
Synonyms:
7-(2,3- difluorobenzyl)- 3H-[1,2,3] triazolo[4,5- b]pyridin-5- amine | US10214527, Example 44
Type:
Small organic molecule
Emp. Form.:
C12H9F2N5
Mol. Mass.:
261.2302
SMILES:
Nc1cc(Cc2cccc(F)c2F)c2nn[nH]c2n1
: