Target
Myeloperoxidase
Ligand
BDBM357687
Substrate
Meas. Tech.
MPO Peroxidation Assay (Amplex Red Assay)
IC50
55±n/a nM
Citation
 Shaw, SASmallheer, JM Triazolopyridine inhibitors of myeloperoxidase US Patent  US10214527 Publication Date 2/26/2019 
Target
Name:
Myeloperoxidase
Synonyms:
84 kDa myeloperoxidase MPO Myeloperoxidase Myeloperoxidase heavy chain PERM_HUMAN
Type:
Enzyme
Mol. Mass.:
83888.32
Organism:
Homo sapiens (Human)
Description:
P05164
Residue:
745
  
Inhibitor
Name:
BDBM357687
Synonyms:
US10214527, Example 59
Type:
Small organic molecule
Emp. Form.:
C21H18N6
Mol. Mass.:
354.4078
SMILES:
Nc1cc(Cc2cccc3n(Cc4ccccc4)ccc23)c2nn[nH]c2n1
: