Target
Tyrosine-protein kinase BTK
Ligand
BDBM359008
Substrate
Meas. Tech.
Btk Enzyme Activity Assay
IC50
0.220±n/a nM
Citation
 Liu, JKozlowski, JABoga, SBGao, XGuiadeen, DGCai, JLiu, SWang, DWu, HYang, C Btk inhibitors US Patent  US10214546 Publication Date 2/26/2019 
Target
Name:
Tyrosine-protein kinase BTK
Synonyms:
AGMX1 Agammaglobulinaemia tyrosine kinase B cell progenitor kinase BPK BTK_HUMAN Tyrosine Kinase BTK Tyrosine-protein kinase BTK (BTK)
Type:
Enzyme
Mol. Mass.:
76289.95
Organism:
Homo sapiens (Human)
Description:
Q06187
Residue:
659
  
Inhibitor
Name:
BDBM359008
Synonyms:
(6R,8aS)-6-[8-amino-5- chloro-1-(4-{(1R)-1-[3-(1,1- difluoroethyl)phenyl)-1- hydroxyethyl}(phenyl) imidazo[1,5-a]pyrazin-3- yl)hexahydroindolizin- 3(2H)-one | US10214546, Example 140
Type:
Small organic molecule
Emp. Form.:
C30H30ClF2N5O2
Mol. Mass.:
566.041
SMILES:
CC(F)(F)c1cccc(c1)[C@](C)(O)c1ccc(cc1)-c1nc([C@@H]2CC[C@H]3CCC(=O)N3C2)n2c(Cl)cnc(N)c12
: