Target
Tyrosine-protein kinase BTK
Ligand
BDBM359069
Substrate
Meas. Tech.
Btk Enzyme Activity Assay
IC50
0.430±n/a nM
Citation
 Liu, JKozlowski, JABoga, SBGao, XGuiadeen, DGCai, JLiu, SWang, DWu, HYang, C Btk inhibitors US Patent  US10214546 Publication Date 2/26/2019 
Target
Name:
Tyrosine-protein kinase BTK
Synonyms:
AGMX1 Agammaglobulinaemia tyrosine kinase B cell progenitor kinase BPK BTK_HUMAN Tyrosine Kinase BTK Tyrosine-protein kinase BTK (BTK)
Type:
Enzyme
Mol. Mass.:
76289.95
Organism:
Homo sapiens (Human)
Description:
Q06187
Residue:
659
  
Inhibitor
Name:
BDBM359069
Synonyms:
(6R,8aS)-6-[8-amino-1- (4-{1-[3- (difluoromethyl)phenyl]- 1-hydroxyethyl}-2- fluorophenyl)imidazo[1,5- a]pyrazin-3-yl]-2,2- dimethylhexahydroindolizin- 3(2H)-one US10214546, Example 203
Type:
Small organic molecule
Emp. Form.:
C31H32F3N5O2
Mol. Mass.:
563.6133
SMILES:
CC(O)(c1cccc(c1)C(F)F)c1ccc(-c2nc([C@@H]3CC[C@H]4CC(C)(C)C(=O)N4C3)n3ccnc(N)c23)c(F)c1
: