Target
Bifunctional dihydrofolate reductase-thymidylate synthase
Ligand
BDBM18497
Substrate
BDBM18044
Meas. Tech.
Determination of IC50
pH
7±n/a
Temperature
298.15±n/a K
IC50
1.4±0.07 nM
Citation
 Pelphrey, PMPopov, VMJoska, TMBeierlein, JMBolstad, ESFillingham, YAWright, DLAnderson, AC Highly efficient ligands for dihydrofolate reductase from Cryptosporidium hominis and Toxoplasma gondii inspired by structural analysis. J Med Chem 50:940-50 (2007)  
Target
Name:
Bifunctional dihydrofolate reductase-thymidylate synthase
Synonyms:
DHFR-TS Dihydrofolate reductase Dihydrofolate reductase; T. gondii vs rat
Type:
Enzyme
Mol. Mass.:
68757.49
Organism:
Toxoplasma gondii
Description:
Q07422
Residue:
610
  
Inhibitor
Name:
BDBM18497
Synonyms:
6-methyl-5-[(3R)-3-(3,4,5-trimethoxyphenyl)but-1-yn-1-yl]pyrimidine-2,4-diamine TMP derivative with propargyl-based linker, 37 (R)
Type:
Small organic molecule
Emp. Form.:
C18H22N4O3
Mol. Mass.:
342.3923
SMILES:
COc1cc(cc(OC)c1OC)[C@@H](C)C#Cc1c(C)nc(N)nc1N
:
Substrate
Name:
BDBM18044
Synonyms:
(2S)-2-[(4-{[(2-amino-4-oxo-1,4,7,8-tetrahydropteridin-6-yl)methyl]amino}phenyl)formamido]pentanedioic acid dihydrofolic acid
Type:
Small organic molecule
Emp. Form.:
C19H21N7O6
Mol. Mass.:
443.4133
SMILES:
Nc1nc2NCC(CNc3ccc(cc3)C(=O)N[C@@H](CCC(O)=O)C(O)=O)=Nc2c(=O)[nH]1
: