Target
Androgen receptor
Ligand
BDBM18656
Substrate
BDBM8885
Meas. Tech.
Luciferase Reporter Assay
Ki
6.2±n/a nM
Citation
 Kinoyama, ITaniguchi, NToyoshima, ANozawa, EKamikubo, TImamura, MMatsuhisa, ASamizu, KKawanimani, ENiimi, THamada, NKoutoku, HFurutani, TKudoh, MOkada, MOhta, MTsukamoto, S (+)-(2R,5S)-4-[4-cyano-3-(trifluoromethyl)phenyl]-2,5-dimethyl-N-[6-(trifluoromethyl)pyridin-3- yl]piperazine-1-carboxamide (YM580) as an orally potent and peripherally selective nonsteroidal androgen receptor antagonist. J Med Chem 49:716-26 (2006)  
Target
Name:
Androgen receptor
Synonyms:
ANDR_RAT Ar Nr3c4 | androgen
Type:
Enzyme
Mol. Mass.:
98219.08
Organism:
Rattus norvegicus (Rat)
Description:
P15207
Residue:
902
  
Inhibitor
Name:
BDBM18656
Synonyms:
(2R,5S)-4-[4-cyano-3-(trifluoromethyl)phenyl]-2,5-dimethyl-N-[6-(trifluoromethyl)pyridin-3-yl]piperazine-1-carboxamide YM580
Type:
Small organic molecule
Emp. Form.:
C21H19F6N5O
Mol. Mass.:
471.3989
SMILES:
C[C@@H]1CN([C@@H](C)CN1C(=O)Nc1ccc(nc1)C(F)(F)F)c1ccc(C#N)c(c1)C(F)(F)F
:
Substrate
Name:
BDBM8885
Synonyms:
(1S,2R,10R,11S,14S,15S)-14-hydroxy-2,15-dimethyltetracyclo[8.7.0.0^{2,7}.0^{11,15}]heptadec-6-en-5-one Testosterone US9682960, Testosterone
Type:
Steroid
Emp. Form.:
C19H28O2
Mol. Mass.:
288.4244
SMILES:
[H][C@@]12CC[C@H](O)[C@@]1(C)CC[C@@]1([H])[C@@]2([H])CCC2=CC(=O)CC[C@]12C
: