Target
Nuclear receptor ROR-gamma
Ligand
BDBM352537
Substrate
Meas. Tech.
biochemical TR-FRET assay
IC50
3.04±n/a nM
Citation
 Aicher, TDVanHuis, CAThomas, WDMacLean, JKAndresen, BMBarr, KJBienstock, CEAnthony, NJDaniels, MLiu, KLiu, YWhite, CMLapointe, BTSciammetta, NSimov, V Tetrahydronaphthyridine, benzoxazine, aza-benzoxazine and related bicyclic compounds for inhibition of RORgamma activity and the treatment of disease US Patent  US10221146 Publication Date 3/5/2019 
Target
Name:
Nuclear receptor ROR-gamma
Synonyms:
NR1F3 Nuclear receptor ROR-gamma (RORC) RAR-related orphan receptor C (RORc) RORG RZRG Retinoid-related orphan receptor-gamma (RORc)
Type:
Enzyme Catalytic Domain
Mol. Mass.:
58218.40
Organism:
Homo sapiens (Human)
Description:
P51449
Residue:
518
  
Inhibitor
Name:
BDBM352537
Synonyms:
(S)-1,1,1-trifluoro-2-methylpropan-2-yl (4-((3,4-difluorophenyl)sulfonyl)-2- (((N-methylsulfamoyl)amino)methyl)- 3,4-dihydro-2H-benzo[b][1,4]oxazin-6- yl)carbamate US9809561, 13Y
Type:
Small organic molecule
Emp. Form.:
C21H23F5N4O7S2
Mol. Mass.:
602.552
SMILES:
CNS(=O)(=O)NC[C@H]1CN(c2cc(NC(=O)OC(C)(C)C(F)(F)F)ccc2O1)S(=O)(=O)c1ccc(F)c(F)c1
: