Target
Nuclear receptor ROR-gamma
Ligand
BDBM352630
Substrate
Meas. Tech.
biochemical TR-FRET assay
IC50
4.47±n/a nM
Citation
 Aicher, TDVanHuis, CAThomas, WDMacLean, JKAndresen, BMBarr, KJBienstock, CEAnthony, NJDaniels, MLiu, KLiu, YWhite, CMLapointe, BTSciammetta, NSimov, V Tetrahydronaphthyridine, benzoxazine, aza-benzoxazine and related bicyclic compounds for inhibition of RORgamma activity and the treatment of disease US Patent  US10221146 Publication Date 3/5/2019 
Target
Name:
Nuclear receptor ROR-gamma
Synonyms:
NR1F3 Nuclear receptor ROR-gamma (RORC) RAR-related orphan receptor C (RORc) RORG RZRG Retinoid-related orphan receptor-gamma (RORc)
Type:
Enzyme Catalytic Domain
Mol. Mass.:
58218.40
Organism:
Homo sapiens (Human)
Description:
P51449
Residue:
518
  
Inhibitor
Name:
BDBM352630
Synonyms:
(S)-tert-butyl (2- (2-(((1-ethyl-1H- pyrazol-3-yl)methyl) amino)-2-oxoethyl)- 4-((3-(trifluoromethyl) phenyl)sulfonyl)- 3,4-dihydro-2H- benzo[b][1,4]oxazin-6- yl)carbamate US9809561, 37S
Type:
Small organic molecule
Emp. Form.:
C28H32F3N5O6S
Mol. Mass.:
623.644
SMILES:
CCn1ccc(CNC(=O)C[C@H]2CN(c3cc(NC(=O)OC(C)(C)C)ccc3O2)S(=O)(=O)c2cccc(c2)C(F)(F)F)n1
: