Target
Nuclear receptor ROR-gamma
Ligand
BDBM352752
Substrate
Meas. Tech.
biochemical TR-FRET assay
IC50
4.09±n/a nM
Citation
 Aicher, TDVanHuis, CAThomas, WDMacLean, JKAndresen, BMBarr, KJBienstock, CEAnthony, NJDaniels, MLiu, KLiu, YWhite, CMLapointe, BTSciammetta, NSimov, V Tetrahydronaphthyridine, benzoxazine, aza-benzoxazine and related bicyclic compounds for inhibition of RORgamma activity and the treatment of disease US Patent  US10221146 Publication Date 3/5/2019 
Target
Name:
Nuclear receptor ROR-gamma
Synonyms:
NR1F3 Nuclear receptor ROR-gamma (RORC) RAR-related orphan receptor C (RORc) RORG RZRG Retinoid-related orphan receptor-gamma (RORc)
Type:
Enzyme Catalytic Domain
Mol. Mass.:
58218.40
Organism:
Homo sapiens (Human)
Description:
P51449
Residue:
518
  
Inhibitor
Name:
BDBM352752
Synonyms:
(R)-tert-butyl (2-(2-acetamido-2- methylpropyl)-4-((4-fluorophenyl)sulfonyl)- 3,4-dihydro-2H-benzo[b][1,4]oxazin-6- yl)carbamate US9809561, 55E
Type:
Small organic molecule
Emp. Form.:
C25H32FN3O6S
Mol. Mass.:
521.601
SMILES:
CC(=O)NC(C)(C)C[C@@H]1CN(c2cc(NC(=O)OC(C)(C)C)ccc2O1)S(=O)(=O)c1ccc(F)cc1
: