Target
Nuclear receptor ROR-gamma
Ligand
BDBM352906
Substrate
Meas. Tech.
biochemical TR-FRET assay
IC50
4.19±n/a nM
Citation
 Aicher, TDVanHuis, CAThomas, WDMacLean, JKAndresen, BMBarr, KJBienstock, CEAnthony, NJDaniels, MLiu, KLiu, YWhite, CMLapointe, BTSciammetta, NSimov, V Tetrahydronaphthyridine, benzoxazine, aza-benzoxazine and related bicyclic compounds for inhibition of RORgamma activity and the treatment of disease US Patent  US10221146 Publication Date 3/5/2019 
Target
Name:
Nuclear receptor ROR-gamma
Synonyms:
NR1F3 Nuclear receptor ROR-gamma (RORC) RAR-related orphan receptor C (RORc) RORG RZRG Retinoid-related orphan receptor-gamma (RORc)
Type:
Enzyme Catalytic Domain
Mol. Mass.:
58218.40
Organism:
Homo sapiens (Human)
Description:
P51449
Residue:
518
  
Inhibitor
Name:
BDBM352906
Synonyms:
2,2,2-trifluoro-1,1- dimethylethyl (1-{[1-ethyl- 3-(2-hydroxyethoxy)-1H- pyrazol-4-yl]sulfonyl}- 1,2,3,4-tetrahydroquinolin- 7-yl)carbamate US9809561, 114B
Type:
Small organic molecule
Emp. Form.:
C21H27F3N4O6S
Mol. Mass.:
520.522
SMILES:
CCn1cc(c(OCCO)n1)S(=O)(=O)N1CCCc2ccc(NC(=O)OC(C)(C)C(F)(F)F)cc12
: