Target
Bifunctional dihydrofolate reductase-thymidylate synthase
Ligand
BDBM18786
Substrate
BDBM18044
Meas. Tech.
Inhibitor Screening Using Bacterial System (IC50) and Measurement of Inhibition Constant (Ki)
pH
7±n/a
Temperature
298.15±n/a K
Ki
0.77±0.05 nM
IC50
2380±490 nM
Citation
 Bunyarataphan, SLeartsakulpanich, UTaweechai, STarnchompoo, BKamchonwongpaisan, SYuthavong, Y Evaluation of the activities of pyrimethamine analogs against Plasmodium vivax and Plasmodium falciparum dihydrofolate reductase-thymidylate synthase using in vitro enzyme inhibition and bacterial complementation assays. Antimicrob Agents Chemother 50:3631-7 (2006)  
Target
Name:
Bifunctional dihydrofolate reductase-thymidylate synthase
Synonyms:
DRTS_PLAVI PvDHFR-TS
Type:
Enzyme
Mol. Mass.:
71083.97
Organism:
Plasmodium vivax (malaria parasite P. vivax)
Description:
O02604
Residue:
623
  
Inhibitor
Name:
BDBM18786
Synonyms:
5-(3-chlorophenyl)-6-(3-phenylpropyl)pyrimidine-2,4-diamine P31
Type:
Small organic molecule
Emp. Form.:
C19H19ClN4
Mol. Mass.:
338.834
SMILES:
Nc1nc(N)c(c(CCCc2ccccc2)n1)-c1cccc(Cl)c1
:
Substrate
Name:
BDBM18044
Synonyms:
(2S)-2-[(4-{[(2-amino-4-oxo-1,4,7,8-tetrahydropteridin-6-yl)methyl]amino}phenyl)formamido]pentanedioic acid dihydrofolic acid
Type:
Small organic molecule
Emp. Form.:
C19H21N7O6
Mol. Mass.:
443.4133
SMILES:
Nc1nc2NCC(CNc3ccc(cc3)C(=O)N[C@@H](CCC(O)=O)C(O)=O)=Nc2c(=O)[nH]1
: