Target
Alpha-1,6-mannosyl-glycoprotein 2-beta-N-acetylglucosaminyltransferase
Ligand
BDBM235180
Substrate
Meas. Tech.
LCMS Assay
IC50
9.00±n/a nM
Citation
 Ahmad, SNegash, LA Dihydropyridinone MGAT2 inhibitors US Patent  US9822074 Publication Date 11/21/2017 
Target
Name:
Alpha-1,6-mannosyl-glycoprotein 2-beta-N-acetylglucosaminyltransferase
Synonyms:
2.4.1.143 GNT-II MGAT2 Mannoside acetylglucosaminyltransferase 2 Monoacylglycerol acyltransferase type 2 (h-MGAT2) h-MGAT2 (human monoacylglycerol acyltransferase type 2)
Type:
Mol. Mass.:
51567.80
Organism:
Homo sapiens (Human)
Description:
Q10469
Residue:
447
  
Inhibitor
Name:
BDBM235180
Synonyms:
US9365558, 3 | US9822074, 3
Type:
Small organic molecule
Emp. Form.:
C27H29F6N3O4S2
Mol. Mass.:
637.657
SMILES:
Cc1ccc(cc1)C1=C(C(=O)NS(=O)(=O)C2CC2)C(=O)N[C@@](C1)(c1ncc(CCCCCCC(F)(F)F)s1)C(F)(F)F
: