Target
Alpha-1,6-mannosyl-glycoprotein 2-beta-N-acetylglucosaminyltransferase
Ligand
BDBM235224
Substrate
Meas. Tech.
LCMS Assay
IC50
16.0±n/a nM
Citation
 Ahmad, SNegash, LA Dihydropyridinone MGAT2 inhibitors US Patent  US9822074 Publication Date 11/21/2017 
Target
Name:
Alpha-1,6-mannosyl-glycoprotein 2-beta-N-acetylglucosaminyltransferase
Synonyms:
2.4.1.143 GNT-II MGAT2 Mannoside acetylglucosaminyltransferase 2 Monoacylglycerol acyltransferase type 2 (h-MGAT2) h-MGAT2 (human monoacylglycerol acyltransferase type 2)
Type:
Mol. Mass.:
51567.80
Organism:
Homo sapiens (Human)
Description:
Q10469
Residue:
447
  
Inhibitor
Name:
BDBM235224
Synonyms:
US9365558, 47 | US9822074, 47
Type:
Small organic molecule
Emp. Form.:
C24H23F7N4O5S
Mol. Mass.:
612.517
SMILES:
CS(=O)(=O)NC(=O)C1=C(C[C@](NC1=O)(c1ccc(OCCCC(F)(F)F)cc1F)C(F)(F)F)c1ccn(n1)C1CC1
: