Target
Alpha-1,6-mannosyl-glycoprotein 2-beta-N-acetylglucosaminyltransferase
Ligand
BDBM235240
Substrate
Meas. Tech.
LCMS Assay
IC50
5.00±n/a nM
Citation
 Ahmad, SNegash, LA Dihydropyridinone MGAT2 inhibitors US Patent  US9822074 Publication Date 11/21/2017 
Target
Name:
Alpha-1,6-mannosyl-glycoprotein 2-beta-N-acetylglucosaminyltransferase
Synonyms:
2.4.1.143 GNT-II MGAT2 Mannoside acetylglucosaminyltransferase 2 Monoacylglycerol acyltransferase type 2 (h-MGAT2) h-MGAT2 (human monoacylglycerol acyltransferase type 2)
Type:
Mol. Mass.:
51567.80
Organism:
Homo sapiens (Human)
Description:
Q10469
Residue:
447
  
Inhibitor
Name:
BDBM235240
Synonyms:
US9365558, 63 | US9822074, 63
Type:
Small organic molecule
Emp. Form.:
C27H26F6N2O5S2
Mol. Mass.:
636.626
SMILES:
FC(F)(F)CCCOc1ccc(cc1)[C@@]1(CC(c2ccc(s2)C2CC2)=C(C(=O)NS(=O)(=O)C2CC2)C(=O)N1)C(F)(F)F
: