Target
Alpha-1,6-mannosyl-glycoprotein 2-beta-N-acetylglucosaminyltransferase
Ligand
BDBM235248
Substrate
Meas. Tech.
LCMS Assay
IC50
12.0±n/a nM
Citation
 Ahmad, SNegash, LA Dihydropyridinone MGAT2 inhibitors US Patent  US9822074 Publication Date 11/21/2017 
Target
Name:
Alpha-1,6-mannosyl-glycoprotein 2-beta-N-acetylglucosaminyltransferase
Synonyms:
2.4.1.143 GNT-II MGAT2 Mannoside acetylglucosaminyltransferase 2 Monoacylglycerol acyltransferase type 2 (h-MGAT2) h-MGAT2 (human monoacylglycerol acyltransferase type 2)
Type:
Mol. Mass.:
51567.80
Organism:
Homo sapiens (Human)
Description:
Q10469
Residue:
447
  
Inhibitor
Name:
BDBM235248
Synonyms:
US9365558, 71 | US9822074, 71
Type:
Small organic molecule
Emp. Form.:
C25H21F9N2O5S
Mol. Mass.:
632.495
SMILES:
CS(=O)(=O)NC(=O)C1=C(C[C@](NC1=O)(c1ccc(OCCCC(F)(F)F)cc1F)C(F)(F)F)c1ccc(cc1)C(F)F
: