Target
Alpha-1,6-mannosyl-glycoprotein 2-beta-N-acetylglucosaminyltransferase
Ligand
BDBM359835
Substrate
Meas. Tech.
LCMS Assay
IC50
8.00±n/a nM
Citation
 Ahmad, SNegash, LA Dihydropyridinone MGAT2 inhibitors US Patent  US9822074 Publication Date 11/21/2017 
Target
Name:
Alpha-1,6-mannosyl-glycoprotein 2-beta-N-acetylglucosaminyltransferase
Synonyms:
2.4.1.143 GNT-II MGAT2 Mannoside acetylglucosaminyltransferase 2 Monoacylglycerol acyltransferase type 2 (h-MGAT2) h-MGAT2 (human monoacylglycerol acyltransferase type 2)
Type:
Mol. Mass.:
51567.80
Organism:
Homo sapiens (Human)
Description:
Q10469
Residue:
447
  
Inhibitor
Name:
BDBM359835
Synonyms:
US9822074, 90
Type:
Small organic molecule
Emp. Form.:
C26H27F7N4O5S
Mol. Mass.:
640.57
SMILES:
CS(=O)(=O)NC(=O)C1=C(C[C@](NC1=O)(c1ccc(OCCCC(F)(F)F)cc1F)C(F)(F)F)c1ccn(CC2CCC2)n1
: