Target
Alpha-1,6-mannosyl-glycoprotein 2-beta-N-acetylglucosaminyltransferase
Ligand
BDBM235271
Substrate
Meas. Tech.
LCMS Assay
IC50
4.00±n/a nM
Citation
 Ahmad, SNegash, LA Dihydropyridinone MGAT2 inhibitors US Patent  US9822074 Publication Date 11/21/2017 
Target
Name:
Alpha-1,6-mannosyl-glycoprotein 2-beta-N-acetylglucosaminyltransferase
Synonyms:
2.4.1.143 GNT-II MGAT2 Mannoside acetylglucosaminyltransferase 2 Monoacylglycerol acyltransferase type 2 (h-MGAT2) h-MGAT2 (human monoacylglycerol acyltransferase type 2)
Type:
Mol. Mass.:
51567.80
Organism:
Homo sapiens (Human)
Description:
Q10469
Residue:
447
  
Inhibitor
Name:
BDBM235271
Synonyms:
US9365558, 94 | US9822074, 94
Type:
Small organic molecule
Emp. Form.:
C30H34F6N4O4S
Mol. Mass.:
660.671
SMILES:
FC(F)(F)CCCCCCn1cc(cn1)[C@@]1(CC(=C(C(=O)NS(=O)(=O)C2CC2)C(=O)N1)c1ccc2CCCCc2c1)C(F)(F)F
: