Target
Thyroid hormone receptor beta
Ligand
BDBM18877
Substrate
BDBM18860
Meas. Tech.
TRbeta-Binding Assay and Thyroid Response Element (TRAFbeta1) Reporter Assay.
pH
7±n/a
Temperature
277.15±n/a K
IC50
0.60±0.07 nM
EC50
0.73±n/a nM
Citation
 Garg, NLi, YLGarcia Collazo, AMLitten, CRyono, DEZhang, MCaringal, YBrigance, RPMeng, WWashburn, WNAgback, PMellström, KRehnmark, SRahimi-Ghadim, MNorin, TGrynfarb, MSandberg, JGrover, GMalm, J Thyroid receptor ligands. Part 8: Thyromimetics derived from N-acylated-alpha-amino acid derivatives displaying modulated pharmacological selectivity compared with KB-141. Bioorg Med Chem Lett 17:4131-4 (2007)  
Target
Name:
Thyroid hormone receptor beta
Synonyms:
ERBA2 Nuclear receptor subfamily 1 group A member 2 THR1 c-erbA-2 | c-erbA-beta
Type:
Receptor
Mol. Mass.:
52793.62
Organism:
Homo sapiens (Human)
Description:
Recombinant hThR was obtained from nuclear extracts from SF9 cells infected with baculovirus vectors encoding for ThRbeta 1.
Residue:
461
  
Inhibitor
Name:
BDBM18877
Synonyms:
(2R)-2-(1-{3,5-dibromo-4-[4-hydroxy-3-(propan-2-yl)phenoxy]phenyl}acetamido)-2-phenylacetic acid | N-acylated-alpha-amino acid derivative, 3g
Type:
Small organic molecule
Emp. Form.:
C25H23Br2NO5
Mol. Mass.:
577.262
SMILES:
CC(C)c1cc(Oc2c(Br)cc(CC(=O)N[C@@H](C(O)=O)c3ccccc3)cc2Br)ccc1O
:
Substrate
Name:
BDBM18860
Synonyms:
(2R)-2-amino-3-[4-(4-hydroxy-3-iodophenoxy)-3,5-diiodophenyl]propanoic acid 3,5,3'-triiodo-L-thyronine (T3) Triiodothyronine US10544075, Compound T3 liothyronine | triothyrone
Type:
Hormone
Emp. Form.:
C15H12I3NO4
Mol. Mass.:
650.9735
SMILES:
N[C@@H](Cc1cc(I)c(Oc2ccc(O)c(I)c2)c(I)c1)C(O)=O
: