Target
Thyroid hormone receptor alpha
Ligand
BDBM18957
Substrate
BDBM18860
Meas. Tech.
TRalpha-Binding Assay.
pH
7.6±n/a
Temperature
295.15±n/a K
IC50
>200000±n/a nM
Citation
 van Beeren, HCBakker, OWiersinga, WM Structure-function relationship of the inhibition of the 3,5,3'-triiodothyronine binding to the alpha1- and beta1-thyroid hormone receptor by amiodarone analogs. Endocrinology 137:2807-14 (1996)  
Target
Name:
Thyroid hormone receptor alpha
Synonyms:
C-erbA-alpha EAR7 THA_CHICK Thyroid Hormone Receptor (TR-alpha) c-erbA-1
Type:
Receptor
Mol. Mass.:
46763.30
Organism:
Gallus gallus (chicken)
Description:
Residue:
408
  
Inhibitor
Name:
BDBM18957
Synonyms:
(2-{4-[(2-butyl-1-benzofuran-3-yl)carbonyl]-2,6-diiodophenoxy}ethyl)diethylamine Amiodarone Cordarone cid_441325
Type:
Small organic molecule
Emp. Form.:
C25H29I2NO3
Mol. Mass.:
645.3116
SMILES:
CCCCc1oc2ccccc2c1C(=O)c1cc(I)c(OCCN(CC)CC)c(I)c1
:
Substrate
Name:
BDBM18860
Synonyms:
(2R)-2-amino-3-[4-(4-hydroxy-3-iodophenoxy)-3,5-diiodophenyl]propanoic acid 3,5,3'-triiodo-L-thyronine (T3) Triiodothyronine US10544075, Compound T3 liothyronine | triothyrone
Type:
Hormone
Emp. Form.:
C15H12I3NO4
Mol. Mass.:
650.9735
SMILES:
N[C@@H](Cc1cc(I)c(Oc2ccc(O)c(I)c2)c(I)c1)C(O)=O
: