Target
Histone deacetylase 1
Ligand
BDBM19152
Substrate
BDBM19150
Meas. Tech.
HDAC Enzyme Activity Assay
pH
8±n/a
Temperature
310.15±n/a K
IC50
1.6±0.03 nM
Comments
MCF7 cells growth inhibition, IC50=37 +/- 4 nM.HeLa nuclear HDACs inhibition, IC50=15 +/- 7 nM.
Citation
 Yurek-George, ACecil, ARMo, AHWen, SRogers, HHabens, FMaeda, SYoshida, MPackham, GGanesan, A The First Biologically Active Synthetic Analogues of FK228, the Depsipeptide Histone Deacetylase Inhibitor. J Med Chem 50:5720-5726 (2007)  
Target
Name:
Histone deacetylase 1
Synonyms:
Cereblon/Histone deacetylase 1 HDAC1 Histone deacetylase 1 (HDAC1) RPD3L1
Type:
Enzyme
Mol. Mass.:
55090.27
Organism:
Homo sapiens (Human)
Description:
Q13547
Residue:
482
  
Inhibitor
Name:
BDBM19152
Synonyms:
(1S,7R,10S,16E,21R)-21-methyl-7-(propan-2-yl)-2-oxa-12,13-dithia-5,8,20,23-tetraazabicyclo[8.7.6]tricos-16-ene-3,6,9,19,22-pentone | FK228 Analogue, 8a
Type:
Small organic molecule
Emp. Form.:
C20H30N4O6S2
Mol. Mass.:
486.605
SMILES:
CC(C)[C@H]1NC(=O)[C@H]2CSSCC\C=C\[C@H](CC(=O)N[C@H](C)C(=O)N2)OC(=O)CNC1=O
:
Substrate
Name:
BDBM19150
Synonyms:
Ac-Arg-Gly-Lys(Ac)-AMC | Ac-KGLGK(Ac)-AMC
Type:
Fluorescent Peptide
Emp. Form.:
C28H40N8O7
Mol. Mass.:
600.6666
SMILES:
[#6]-[#6](=O)-[#7]-[#6]-[#6]-[#6]-[#6]-[#6@H](-[#7]-[#6](=O)-[#6]-[#7]-[#6](=O)-[#6@H](-[#6]-[#6]-[#6]\[#7]=[#6](\[#7])-[#7])-[#7]-[#6](-[#6])=O)-[#6](=O)-[#7]-c1ccc2c(-[#6])cc(=O)oc2c1
: