Target
Amine oxidase [flavin-containing] A
Ligand
BDBM19186
Substrate
BDBM10990
Meas. Tech.
MAO Inhibition Assay
pH
7.4±n/a
Temperature
310.15±n/a K
IC50
12000±2800 nM
Citation
 Carotti, ACatto, MLeonetti, FCampagna, FSoto-Otero, RMéndez-Alvarez, EThull, UTesta, BAltomare, C Synthesis and monoamine oxidase inhibitory activity of new pyridazine-, pyrimidine- and 1,2,4-triazine-containing tricyclic derivatives. J Med Chem 50:5364-71 (2007)  
Target
Name:
Amine oxidase [flavin-containing] A
Synonyms:
AOFA_RAT Amine oxidase [flavin-containing] A Monoamine Oxidase Type A (MAO-A) Monoamine oxidase A (MAO-A) Monoamine oxidase type A (MAOA)
Type:
Enzyme
Mol. Mass.:
59515.21
Organism:
Rattus norvegicus (rat)
Description:
Residue:
526
  
Inhibitor
Name:
BDBM19186
Synonyms:
17-azatetracyclo[8.7.0.0^{2,7}.0^{11,16}]heptadeca-1(10),2(7),3,5,11(16),12,14-heptaene | Aza-heterocyclic Derivative, 7
Type:
Small organic molecule
Emp. Form.:
C16H13N
Mol. Mass.:
219.2811
SMILES:
C1Cc2ccccc2-c2[nH]c3ccccc3c12
:
Substrate
Name:
BDBM10990
Synonyms:
3-amino-1-(2-aminophenyl)propan-1-one Kynuramine
Type:
Small organic molecule
Emp. Form.:
C9H12N2O
Mol. Mass.:
164.2044
SMILES:
NCCC(=O)c1ccccc1N
: