Target
Amine oxidase [flavin-containing] B
Ligand
BDBM19172
Substrate
BDBM10990
Meas. Tech.
MAO Inhibition Assay
IC50
>100000±n/a nM
Citation
 Carotti, ACatto, MLeonetti, FCampagna, FSoto-Otero, RMéndez-Alvarez, EThull, UTesta, BAltomare, C Synthesis and monoamine oxidase inhibitory activity of new pyridazine-, pyrimidine- and 1,2,4-triazine-containing tricyclic derivatives. J Med Chem 50:5364-71 (2007)  
Target
Name:
Amine oxidase [flavin-containing] B
Synonyms:
AOFB_RAT Amine oxidase [flavin-containing] B Monoamine Oxidase Type B (MAO-B) Monoamine oxidase B (MAO-B) Monoamine oxidase type B (MAOB) | Monoamine oxidase-B (MAO-B)
Type:
Enzyme
Mol. Mass.:
58469.65
Organism:
Rattus norvegicus (rat)
Description:
P19643
Residue:
520
  
Inhibitor
Name:
BDBM19172
Synonyms:
4-(4-chlorophenyl)-5H-indeno[1,2-c]pyridazin-5-one | Aza-heterocyclic Derivative, 1j
Type:
Small organic molecule
Emp. Form.:
C17H9ClN2O
Mol. Mass.:
292.719
SMILES:
Clc1ccc(cc1)-c1cnnc2-c3ccccc3C(=O)c12
:
Substrate
Name:
BDBM10990
Synonyms:
3-amino-1-(2-aminophenyl)propan-1-one Kynuramine
Type:
Small organic molecule
Emp. Form.:
C9H12N2O
Mol. Mass.:
164.2044
SMILES:
NCCC(=O)c1ccccc1N
: