Target
Cathepsin S
Ligand
BDBM19568
Substrate
BDBM19546
Meas. Tech.
Enzyme Inhibition Assay
Ki
5.0±n/a nM
Citation
 Liu, HTully, DCEpple, RBursulaya, BLi, JHarris, JLWilliams, JARusso, RTumanut, CRoberts, MJAlper, PBHe, YKaranewsky, DS Design and synthesis of arylaminoethyl amides as noncovalent inhibitors of cathepsin S. Part 1. Bioorg Med Chem Lett 15:4979-84 (2005)  
Target
Name:
Cathepsin S
Synonyms:
CATS_HUMAN Cathepsin S (Cat S) | cathepsin S preproprotein
Type:
Protein
Mol. Mass.:
37507.38
Organism:
Homo sapiens (Human)
Description:
P25774
Residue:
331
  
Inhibitor
Name:
BDBM19568
Synonyms:
(2S)-3-cyclohexyl-N-{2-[(4-methoxyphenyl)amino]ethyl}-2-(naphthalen-2-ylformamido)propanamide | arylaminoethyl amide, 6
Type:
Small organic molecule
Emp. Form.:
C29H35N3O3
Mol. Mass.:
473.6065
SMILES:
COc1ccc(NCCNC(=O)[C@H](CC2CCCCC2)NC(=O)c2ccc3ccccc3c2)cc1
:
Substrate
Name:
BDBM19546
Synonyms:
7-amino-3-carbamoylmethyl-4-methyl coumarin labeled fluorescent peptide | Ac-His-Pro-Val-Lys-ACMC
Type:
Emp. Form.:
Mol. Mass.:
SMILES:
: