Target
Caspase-3
Ligand
BDBM10323
Substrate
Caspase-7 Fluorometric Substrate Ac-Asp-Glu-Val-Asp-AFC
Ki
2.5±n/a nM
Citation
 Aulabaugh, AKapoor, BHuang, XDollings, PHum, WTBanker, AWood, AEllestad, G Biochemical and biophysical characterization of inhibitor binding to caspase-3 reveals induced asymmetry. Biochemistry 46:9462-71 (2007)  
Target
Name:
Caspase-3
Synonyms:
Apopain CASP3 CPP-32 Caspase 3 Caspase-3 subunit p17 SCA-1 Yama protein | caspase-3 preproprotein
Type:
Hydrolase; heterotetramer of two heterodimers
Mol. Mass.:
31607.55
Organism:
Homo sapiens (Human)
Description:
Residue:
277
  
Inhibitor
Name:
BDBM10323
Synonyms:
(S)-1-Benzyl-5-{1-[2-(phenoxymethyl)pyrrolidinyl]sulfonyl}isatin CHEMBL439753 Isatin Sulfonamide 34 Pyrrolidine Isatin Analogue 2
Type:
Small organic molecule
Emp. Form.:
C26H24N2O5S
Mol. Mass.:
476.544
SMILES:
O=C1N(Cc2ccccc2)c2ccc(cc2C1=O)S(=O)(=O)N1CCC[C@H]1COc1ccccc1
:
Substrate
Name:
Caspase-7 Fluorometric Substrate Ac-Asp-Glu-Val-Asp-AFC
Synonyms:
Ac-DEVD-AFC Fluorometric Tetrapeptide Ac-DEVD-AMC
Type:
Peptide
Mol. Mass.:
473.41
Organism:
Description:
Molecular Mass of DEVD
Residue:
4
DEVD