Target
ALK tyrosine kinase receptor [L1196M]
Ligand
BDBM243432
Substrate
IC50
1.30±n/a nM
Citation
 Yun, CSKim, HRCho, SYJung, HJLee, KChae, CHLee, COPark, CHKim, PHwang, JYHa, JDAhn, SJ Pyrimidine-2,4-diamine derivative and anticancer pharmaceutical composition comprising same as effective ingredient US Patent  US10053458 Publication Date 8/21/2018 
Target
Name:
ALK tyrosine kinase receptor [L1196M]
Synonyms:
ALK ALK tyrosine kinase receptor (ALK) (L1196M) ALK tyrosine kinase receptor (L1196M) Anaplastic lymphoma kinase L1196M (ALK L1196M) | Tyrosine-protein kinase receptor [L1196M]
Type:
Mol. Mass.:
176471.13
Organism:
Homo sapiens (Human)
Description:
Q9UM73[L1196M]
Residue:
1620
  
Inhibitor
Name:
BDBM243432
Synonyms:
5-chloro-N4-(2-(isopropylsulfonyl)phenyl)-N2-(6-methoxy-1-methyl-1,2,3,4-tetrahydroquinolin-7-yl)pyrimidine-2,4-diamine | US10053458, 46
Type:
Small organic molecule
Emp. Form.:
C24H28ClN5O3S
Mol. Mass.:
502.029
SMILES:
COc1cc2CCNC(C)c2cc1Nc1ncc(Cl)c(Nc2ccccc2S(=O)(=O)C(C)C)n1
: