Target
Orexin/Hypocretin receptor type 1
Ligand
BDBM143778
Substrate
Meas. Tech.
Radioligand Binding Assay
Ki
17.0±n/a nM
Citation
 Gelin, CFLebold, TPShireman, BT Substituted 2-azabicycles and their use as orexin receptor modulators US Patent  US9845333 Publication Date 12/19/2017 
Target
Name:
Orexin/Hypocretin receptor type 1
Synonyms:
HCRTR1 OX1R_HUMAN Orexin receptor type 1 (OR 1) Orexin receptor type 1 (OX1) Orexin receptor type 1 (OxR1) | Ox1r
Type:
Protein
Mol. Mass.:
47554.50
Organism:
Homo sapiens (Human)
Description:
O43613
Residue:
425
  
Inhibitor
Name:
BDBM143778
Synonyms:
US10183953, Example 39 US9611277, Example 39 | US9845333, 39
Type:
Small organic molecule
Emp. Form.:
C23H21F3N4O3
Mol. Mass.:
458.433
SMILES:
COc1cccc(-c2ccn[nH]2)c1C(=O)N1CC2CC(Oc3ccc(cn3)C(F)(F)F)C1C2
: