Target
P2X purinoceptor 3
Ligand
BDBM244279
Substrate
Meas. Tech.
Receptor Inhibition Assay
pH
7.5±n/a
IC50
4.00±n/a nM
Comments
extracted
Citation
 Kai, HTanaka, SHiramatsu, YNozu, ANakamura, K Heterocyclic ring and carbocyclic derivative US Patent  US9550763 Publication Date 1/24/2017 
Target
Name:
P2X purinoceptor 3
Synonyms:
ATP receptor P2RX3 P2X purinoceptor 3 P2X purinoceptor 3 (P2X3) P2X3 purinoceptor p2x3 + hsa
Type:
Protein
Mol. Mass.:
44292.02
Organism:
Homo sapiens (Human)
Description:
P56373
Residue:
397
  
Inhibitor
Name:
BDBM244279
Synonyms:
US9550763, Compound I-027
Type:
Small organic molecule
Emp. Form.:
C26H24ClN5O4
Mol. Mass.:
505.953
SMILES:
CCn1c(=O)cc(Nc2ccc(Oc3cccc(n3)C(N)=O)c(C)c2)n(Cc2ccc(Cl)cc2)c1=O
: