Target
Cathepsin S
Ligand
BDBM20092
Substrate
BDBM20129
Meas. Tech.
Papain Inhibition Assay
Ki
550±n/a nM
Citation
 Löser, RSchilling, KDimmig, EGütschow, M Interaction of papain-like cysteine proteases with dipeptide-derived nitriles. J Med Chem 48:7688-707 (2005)  
Target
Name:
Cathepsin S
Synonyms:
CATS_HUMAN Cathepsin S (Cat S) | cathepsin S preproprotein
Type:
Protein
Mol. Mass.:
37507.38
Organism:
Homo sapiens (Human)
Description:
P25774
Residue:
331
  
Inhibitor
Name:
BDBM20092
Synonyms:
dipeptide-derived nitrile, 13 | tert-butyl N-[(1S)-1-[(cyanomethyl)carbamoyl]pentyl]carbamate
Type:
Small organic molecule
Emp. Form.:
C13H23N3O3
Mol. Mass.:
269.34
SMILES:
CCCC[C@H](NC(=O)OC(C)(C)C)C(=O)NCC#N
:
Substrate
Name:
BDBM20129
Synonyms:
Z-Val-Val-Arg-NH-4-methylcoumarin-7-yl | Z-Val-Val-Arg-NHMec
Type:
Emp. Form.:
Mol. Mass.:
SMILES:
: