Target
Cathepsin K
Ligand
BDBM20092
Substrate
BDBM20130
Meas. Tech.
Papain Inhibition Assay
Ki
1270±n/a nM
Citation
 Löser, RSchilling, KDimmig, EGütschow, M Interaction of papain-like cysteine proteases with dipeptide-derived nitriles. J Med Chem 48:7688-707 (2005)  
Target
Name:
Cathepsin K
Synonyms:
CATK_HUMAN CTSO Cathepsin O Cathepsin X
Type:
Enzyme
Mol. Mass.:
36975.68
Organism:
Homo sapiens (Human)
Description:
P43235
Residue:
329
  
Inhibitor
Name:
BDBM20092
Synonyms:
dipeptide-derived nitrile, 13 | tert-butyl N-[(1S)-1-[(cyanomethyl)carbamoyl]pentyl]carbamate
Type:
Small organic molecule
Emp. Form.:
C13H23N3O3
Mol. Mass.:
269.34
SMILES:
CCCC[C@H](NC(=O)OC(C)(C)C)C(=O)NCC#N
:
Substrate
Name:
BDBM20130
Synonyms:
Z-Leu-Arg-NH-4-methylcoumarin-7-yl | Z-Leu-Arg-NHMec
Type:
Emp. Form.:
Mol. Mass.:
SMILES:
: