Target
Oxysterols receptor LXR-alpha
Ligand
BDBM20164
Substrate
biotinylated SRC-1 peptide
Meas. Tech.
Cell-Free Ligand Sensing Assay (LiSA)-LXRalpha-SRC1 Assay
pH
7.5±n/a
Temperature
295.15±n/a K
EC50
95±4 nM
Comments
The relative efficacy (RE) compared to 24(S),25-epoxycholesterol is 1 in LXRalpha-SRC1 assay. The EC50=3000 +/- 750 nM for LXRalpha-GAL4 gene expression with RE=1.
Citation
 Collins, JLFivush, AMWatson, MAGalardi, CMLewis, MCMoore, LBParks, DJWilson, JGTippin, TKBinz, JGPlunket, KDMorgan, DGBeaudet, EJWhitney, KDKliewer, SAWillson, TM Identification of a nonsteroidal liver X receptor agonist through parallel array synthesis of tertiary amines. J Med Chem 45:1963-6 (2002)  
Target
Name:
Oxysterols receptor LXR-alpha
Synonyms:
LXRA Liver X receptor alpha Liver X receptor alpha (NR1H3) NR1H3 Nuclear orphan receptor LXR-alpha | Nuclear receptor subfamily 1 group H member 3
Type:
Enzyme Catalytic Domain
Mol. Mass.:
50403.85
Organism:
Homo sapiens (Human)
Description:
Q13133
Residue:
447
  
Inhibitor
Name:
BDBM20164
Synonyms:
(1S,2R,5S,10S,11S,14R,15R)-14-[(2R)-4-[(2S)-3,3-dimethyloxiran-2-yl]butan-2-yl]-2,15-dimethyltetracyclo[8.7.0.0^{2,7}.0^{11,15}]heptadec-7-en-5-ol CHEMBL434302 | Epoxycholesterol
Type:
Steroid
Emp. Form.:
C27H44O2
Mol. Mass.:
400.6371
SMILES:
[H][C@@]1(CC[C@@H](C)[C@@]2([H])CC[C@@]3([H])[C@]4([H])CC=C5C[C@@]([H])(O)CC[C@]5(C)[C@@]4([H])CC[C@]23C)OC1(C)C
:
Substrate
Name:
biotinylated SRC-1 peptide
Synonyms:
Type:
Peptide
Mol. Mass.:
3157.52
Organism:
Description:
A biotinylated peptide comprises amino acids 675-699 of steroid receptor coactivator 1 (SRC1).
Residue:
28