Target
Transient receptor potential cation channel subfamily V member 1
Ligand
BDBM20284
Substrate
BDBM20285
Meas. Tech.
Competition Binding Assay and Inhibition of Ca2+ Uptake Assay
pH
7.4±n/a
Temperature
310.15±n/a K
Ki
1300±150 nM
EC50
520±12 nM
Citation
 Chung, JUKim, SYLim, JOChoi, HKKang, SUYoon, HSRyu, HKang, DWLee, JKang, BChoi, SToth, APearce, LVPavlyukovets, VALundberg, DJBlumberg, PM Alpha-substituted N-(4-tert-butylbenzyl)-N'-[4-(methylsulfonylamino)benzyl]thiourea analogues as potent and stereospecific TRPV1 antagonists. Bioorg Med Chem 15:6043-53 (2007)  
Target
Name:
Transient receptor potential cation channel subfamily V member 1
Synonyms:
Capsaicin receptor TRPV1_RAT Trpv1 Vanilloid VR1 Vanilloid receptor 1 (VRI/TRPV1) Vanilloid receptor type 1-like (TrpV1/Vr1) Vr1l | osm-9-like TRP channel 1
Type:
Transient Receptor
Mol. Mass.:
94956.12
Organism:
Rattus norvegicus (rat)
Description:
O35433
Residue:
838
  
Inhibitor
Name:
BDBM20284
Synonyms:
CHEMBL391997 Capsazepine N-[2-(4-chlorophenyl)ethyl]-7,8-dihydroxy-2,3,4,5-tetrahydro-1H-2-benzazepine-2-carbothioamide
Type:
Small organic molecule
Emp. Form.:
C19H21ClN2O2S
Mol. Mass.:
376.9
SMILES:
Oc1cc2CCCN(Cc2cc1O)C(=S)NCCc1ccc(Cl)cc1
:
Substrate
Name:
BDBM20285
Synonyms:
Resiniferatoxin | [(1R,2R,6R,10S,11R,15R,17R)-13-benzyl-6-hydroxy-4,17-dimethyl-5-oxo-15-(prop-1-en-2-yl)-12,14,18-trioxapentacyclo[11.4.1.0^{1,10}.0^{2,6}.0^{11,15}]octadeca-3,8-dien-8-yl]methyl 2-(4-hydroxy-3-methoxyphenyl)acetate
Type:
Small organic molecule
Emp. Form.:
C37H40O9
Mol. Mass.:
628.7081
SMILES:
[H][C@]12OC3(Cc4ccccc4)O[C@]1(C[C@@H](C)[C@]1(O3)[C@]3([H])C=C(C)C(=O)[C@@]3(O)CC(COC(=O)Cc3ccc(O)c(OC)c3)=C[C@@]21[H])C(C)=C
: