Target
Heat shock protein HSP 90-beta
Ligand
BDBM20785
Substrate
BDBM10852
Meas. Tech.
Her-2 Degradation Assay
EC50
30±n/a nM
Citation
 Zhang, LFan, JVu, KHong, KLe Brazidec, JYShi, JBiamonte, MBusch, DJLough, REGrecko, RRan, YSensintaffar, JLKamal, ALundgren, KBurrows, FJMansfield, RTimony, GAUlm, EHKasibhatla, SRBoehm, MF 7'-substituted benzothiazolothio- and pyridinothiazolothio-purines as potent heat shock protein 90 inhibitors. J Med Chem 49:5352-62 (2006)  
Target
Name:
Heat shock protein HSP 90-beta
Synonyms:
HS90B_HUMAN HSP 90 HSP90B HSPCB Heat shock protein HSP 90 (Hsp90)
Type:
Molecular Chaperone
Mol. Mass.:
83229.45
Organism:
Homo sapiens (Human)
Description:
P08238
Residue:
724
  
Inhibitor
Name:
BDBM20785
Synonyms:
CHEMBL212850 diethyl {2-[6-amino-8-({7-chloropyrido[3,4-d][1,3]thiazol-2-yl}sulfanyl)-9H-purin-9-yl]ethyl}phosphonate
Type:
Small organic molecule
Emp. Form.:
C17H19ClN7O3PS2
Mol. Mass.:
499.935
SMILES:
CCOP(=O)(CCn1c(Sc2nc3cncc(Cl)c3s2)nc2c(N)ncnc12)OCC
:
Substrate