Target
Heat shock protein HSP 90-beta
Ligand
BDBM20928
Substrate
BDBM15527
Meas. Tech.
Fluorescence Polarization (FP) Assay and Cell Growth Inhibition (SRB) Assay
IC50
6±n/a nM
EC50
40±n/a nM
Citation
 Brough, PAAherne, WBarril, XBorgognoni, JBoxall, KCansfield, JECheung, KMCollins, IDavies, NGDrysdale, MJDymock, BEccles, SAFinch, HFink, AHayes, AHowes, RHubbard, REJames, KJordan, AMLockie, AMartins, VMassey, AMatthews, TPMcDonald, ENorthfield, CJPearl, LHProdromou, CRay, SRaynaud, FIRoughley, SDSharp, SYSurgenor, AWalmsley, DLWebb, PWood, MWorkman, PWright, L 4,5-diarylisoxazole Hsp90 chaperone inhibitors: potential therapeutic agents for the treatment of cancer. J Med Chem 51:196-218 (2008)  
Target
Name:
Heat shock protein HSP 90-beta
Synonyms:
HS90B_HUMAN HSP 90 HSP90B HSPCB Heat shock protein HSP 90 (Hsp90)
Type:
Molecular Chaperone
Mol. Mass.:
83229.45
Organism:
Homo sapiens (Human)
Description:
P08238
Residue:
724
  
Inhibitor
Name:
BDBM20928
Synonyms:
5-[2,4-dihydroxy-5-(propan-2-yl)phenyl]-N-ethyl-4-[4-(piperidin-1-ylmethyl)phenyl]-1,2-oxazole-3-carboxamide US10413550, Example 78a US9718793, 78a
Type:
Small organic molecule
Emp. Form.:
C27H33N3O4
Mol. Mass.:
463.5686
SMILES:
CCNC(=O)c1noc(c1-c1ccc(CN2CCCCC2)cc1)-c1cc(C(C)C)c(O)cc1O
:
Substrate
Name:
BDBM15527
Synonyms:
5-[({4-[3-(5-chloro-2,4-dihydroxyphenyl)-5-(ethylcarbamoyl)-1H-pyrazol-4-yl]phenyl}methyl)carbamoyl]-2-(6-hydroxy-3-oxo-3H-xanthen-9-yl)benzoic acid VER-00051001
Type:
Fluorescently labeled probe
Emp. Form.:
C40H29ClN4O9
Mol. Mass.:
745.133
SMILES:
CCNC(=O)c1[nH]nc(c1-c1ccc(CNC(=O)c2ccc(c(c2)C(O)=O)-c2c3ccc(O)cc3oc3cc(=O)ccc23)cc1)-c1cc(Cl)c(O)cc1O
: