Target
Metallo-beta-lactamase GIM-1
Ligand
BDBM367676
Substrate
Meas. Tech.
MBL Inhibitory Activity in Constructed E. coli Cells Expressing MBLs
IC50
2260±n/a nM
Citation
 Rongved, PÅstrand, OABayer, ALeiros, HSSamuelsen, nullEdvardsen, KSMuhammad, Z Inhibitors of metallo-beta-lactamase (MBL) comprising a zinc chelating moiety US Patent  US10227327 Publication Date 3/12/2019 
Target
Name:
Metallo-beta-lactamase GIM-1
Synonyms:
GIM-1 Metallo-beta-lactamase GIM-1
Type:
Enzyme Catalytic Domain
Mol. Mass.:
27418.35
Organism:
Pseudomonas aeruginosa
Description:
Residue:
250
  
Inhibitor
Name:
BDBM367676
Synonyms:
1-(1-(4-methoxybenzyl)-1H-1,2,3-triazol-4-yl)-N,N-bis(pyridin-2-ylmethyl)methanamine (OAA2168) | US10227327, Example 3
Type:
Small organic molecule
Emp. Form.:
C23H24N6O
Mol. Mass.:
400.4763
SMILES:
COc1ccc(Cn2cc(CN(Cc3ccccn3)Cc3ccccn3)nn2)cc1
: