Target
Adenosine receptor A2a
Ligand
BDBM21186
Substrate
BDBM21190
Meas. Tech.
Receptor Binding Assay
Ki
53.4±n/a nM
Citation
 Slee, DHChen, YZhang, XMoorjani, MLanier, MCLin, ERueter, JKWilliams, JPLechner, SMMarkison, SMalany, SSantos, MGross, RSJalali, KSai, YZuo, ZYang, CCastro-Palomino, JCCrespo, MIPrat, MGual, SDíaz, JLSaunders, J 2-Amino-N-pyrimidin-4-ylacetamides as A2A Receptor Antagonists: 1. Structure-Activity Relationships and Optimization of Heterocyclic Substituents. J Med Chem 51:1719-29 (2008)  
Target
Name:
Adenosine receptor A2a
Synonyms:
A2A adenosine receptor (hA2A) ADENOSINE A2 ADORA2 Adenosine A2A receptor (A2AAR)
Type:
G Protein-Coupled Receptor (GPCR)
Mol. Mass.:
44716.46
Organism:
Homo sapiens (Human)
Description:
P29274
Residue:
412
  
Inhibitor
Name:
BDBM21186
Synonyms:
2-(4-methylpiperazin-1-yl)-N-[6-(1H-pyrazol-1-yl)-2-(pyridin-2-yl)pyrimidin-4-yl]acetamide | Pyrimidine analogue, 38
Type:
Small organic molecule
Emp. Form.:
C19H22N8O
Mol. Mass.:
378.431
SMILES:
CN1CCN(CC(=O)Nc2cc(nc(n2)-c2ccccn2)-n2cccn2)CC1
:
Substrate
Name:
BDBM21190
Synonyms:
4-(2-{[5-amino-2-(furan-2-yl)-[1,2,4]triazolo[1,5-a][1,3,5]triazin-7-yl]amino}ethyl)phenol ZM 241385 [3H]-ZM241385
Type:
Small organic molecule
Emp. Form.:
C16H15N7O2
Mol. Mass.:
337.336
SMILES:
Nc1nc(NCCc2ccc(O)cc2)nc2nc(nn12)-c1ccco1
: